{"text_format":"3","workbook":"xlsx","n_sheets":5,"sheets":["Validation Summary","Data","Historic Data","Look-up","Comments"],"not_rendered":{"defined_names":1},"read":"whole","date_system":"1900"}

{"sheet":"Validation Summary","index":0,"n_rows":172,"n_cols":25,"rows_kept":172,"merged":[[1,1,1,2],[2,1,2,2],[6,9,6,13],[17,9,17,13],[31,9,31,13],[43,9,43,12],[44,9,44,12],[46,9,46,13],[62,2,62,4],[63,2,63,4],[64,2,64,4],[65,2,65,4],[70,9,70,12],[71,9,71,12],[75,4,75,10],[84,2,84,4],[86,4,86,13],[98,4,98,13],[100,4,100,13],[102,4,102,13],[104,4,104,13],[109,6,109,7],[109,9,109,10],[110,6,110,7],[110,9,110,10],[110,14,110,20],[114,6,114,7],[114,9,114,10],[114,14,114,20],[115,6,115,7],[115,9,115,10],[115,14,115,20],[116,6,116,7],[116,9,116,10],[116,14,116,20],[117,6,117,7],[117,9,117,10],[117,14,117,20],[118,6,118,7],[118,9,118,10],[118,14,118,20],[119,6,119,7],[119,9,119,10],[119,14,119,20],[120,6,120,7],[120,9,120,10],[120,14,120,20],[121,6,121,7],[121,9,121,10],[121,14,121,20],[122,6,122,7],[122,9,122,10],[122,14,122,20],[123,6,123,7],[123,9,123,10],[123,14,123,20],[124,6,124,7],[124,9,124,10],[124,14,124,20],[125,6,125,7],[125,9,125,10],[125,14,125,20],[126,6,126,7],[126,9,126,10],[126,14,126,20],[127,6,127,7],[127,9,127,10],[127,14,127,20],[128,6,128,7],[128,9,128,10],[128,14,128,20],[131,6,131,7],[131,9,131,10],[131,14,131,20],[132,6,132,7],[132,9,132,10],[132,14,132,20],[133,6,133,7],[133,9,133,10],[133,14,133,20],[134,6,134,7],[134,9,134,10],[134,14,134,20],[135,6,135,7],[135,9,135,10],[135,14,135,20],[136,6,136,7],[136,9,136,10],[136,14,136,20],[137,6,137,7],[137,9,137,10],[137,14,137,20],[138,6,138,7],[138,9,138,10],[138,14,138,20],[139,6,139,7],[139,9,139,10],[139,14,139,20],[140,6,140,7],[140,9,140,10],[140,14,140,20],[143,6,143,7],[143,9,143,10],[143,14,143,20],[144,6,144,7],[144,9,144,10],[144,14,144,20],[145,6,145,7],[145,9,145,10],[145,14,145,20],[146,6,146,7],[146,9,146,10],[146,14,146,20],[147,6,147,7],[147,9,147,10],[147,14,147,20],[148,6,148,7],[148,9,148,10],[148,14,148,20],[149,6,149,7],[149,9,149,10],[149,14,149,20],[152,6,152,7],[152,9,152,10],[152,14,152,20],[153,6,153,7],[153,9,153,10],[153,14,153,20],[154,6,154,7],[154,9,154,10],[154,14,154,20],[155,6,155,7],[155,9,155,10],[155,14,155,20],[156,6,156,7],[156,9,156,10],[156,14,156,20],[157,6,157,7],[157,9,157,10],[157,14,157,20],[158,6,158,7],[158,9,158,10],[158,14,158,20],[159,6,159,7],[159,9,159,10],[159,14,159,20],[160,6,160,7],[160,9,160,10],[160,14,160,20],[161,6,161,7],[161,9,161,10],[161,14,161,20],[165,6,165,7],[165,9,165,10],[165,14,165,20],[166,6,166,7],[166,9,166,10],[166,14,166,20],[167,6,167,7],[167,9,167,10],[167,14,167,20],[168,6,168,7],[168,9,168,10],[168,14,168,20],[169,6,169,7],[169,9,169,10],[169,14,169,20],[170,6,170,7],[170,9,170,10],[170,14,170,20],[171,6,171,7],[171,9,171,10],[171,14,171,20]]}
[]
[null,"Authority",null,{"$f":"Data!B2","v":"Hastings Borough Council"},{"$nulls":5},"v4"]
[null,"Quarter",null,{"$f":"VLOOKUP(Data!C2,Quarter,3,0)","v":"Oct 20 - Dec 20"}]
[]
[null,"Incidents"]
[]
[null,"I0101","Total number of incidents this period",{"$nulls":3},{"$f":"SUMIF(Data!$F$2:$F$232,B7,Data!$H$2:$H$232)","v":132}]
[]
[]
[null,null,"Number of incidents by land type"]
[]
[null,"I0201","Highway",{"$nulls":3},{"$f":"SUMIF(Data!$F$2:$F$232,B12,Data!$H$2:$H$232)","v":116},null,"I0202","Agriculture",{"$nulls":3},{"$f":"SUMIF(Data!$F$2:$F$232,I12,Data!$H$2:$H$232)","v":0}]
[null,"I0301","Footpath / Bridleway",{"$nulls":3},{"$f":"SUMIF(Data!$F$2:$F$232,B13,Data!$H$2:$H$232)","v":11},null,"I0302","Private Residence",{"$nulls":3},{"$f":"SUMIF(Data!$F$2:$F$232,I13,Data!$H$2:$H$232)","v":0}]
[null,"I0401","Back Alley",{"$nulls":3},{"$f":"SUMIF(Data!$F$2:$F$232,B14,Data!$H$2:$H$232)","v":3},null,"I0402","Commercial / Industrial",{"$nulls":3},{"$f":"SUMIF(Data!$F$2:$F$232,I14,Data!$H$2:$H$232)","v":0}]
[null,"I0501","Railway",{"$nulls":3},{"$f":"SUMIF(Data!$F$2:$F$232,B15,Data!$H$2:$H$232)","v":0},null,"I0502","Water course / bank",{"$nulls":3},{"$f":"SUMIF(Data!$F$2:$F$232,I15,Data!$H$2:$H$232)","v":0}]
[null,"I0601","Council Land",{"$nulls":3},{"$f":"SUMIF(Data!$F$2:$F$232,B16,Data!$H$2:$H$232)","v":1},null,"I0602","Other (unidentified)",{"$nulls":3},{"$f":"SUMIF(Data!$F$2:$F$232,I16,Data!$H$2:$H$232)","v":1}]
[]
[null,null,"Sum of incidents by land type",{"$nulls":3},{"$f":"SUM(G12:G16,N12:N16)","v":132},{"$f":"IF(G18=G7,\"OK\",\"Check\")","v":"OK"},null,{"$f":"IF(H18=\"Check\",\"The total number of incidents recorded in this part does not match the total number given in the first part of the incidents section.\",\"\")","v":""}]
[]
[]
[null,null,"Number of incidents by primary waste type"]
[]
[null,"I0701","Animal Carcass",{"$nulls":3},{"$f":"SUMIF(Data!$F$2:$F$232,B23,Data!$H$2:$H$232)","v":0},null,"I0702","Construction / demolition / excavation",{"$nulls":3},{"$f":"SUMIF(Data!$F$2:$F$232,I23,Data!$H$2:$H$232)","v":8}]
[null,"I0801","Green",{"$nulls":3},{"$f":"SUMIF(Data!$F$2:$F$232,B24,Data!$H$2:$H$232)","v":2},null,"I0802","Black bags - commercial",{"$nulls":3},{"$f":"SUMIF(Data!$F$2:$F$232,I24,Data!$H$2:$H$232)","v":0}]
[null,"I0901","Vehicle Parts",{"$nulls":3},{"$f":"SUMIF(Data!$F$2:$F$232,B25,Data!$H$2:$H$232)","v":0},null,"I0902","Black bags - household",{"$nulls":3},{"$f":"SUMIF(Data!$F$2:$F$232,I25,Data!$H$2:$H$232)","v":0}]
[null,"I1001","White goods",{"$nulls":3},{"$f":"SUMIF(Data!$F$2:$F$232,B26,Data!$H$2:$H$232)","v":11},null,"I1002","Chemical drums, oil, fuel",{"$nulls":3},{"$f":"SUMIF(Data!$F$2:$F$232,I26,Data!$H$2:$H$232)","v":1}]
[null,"I1101","Other electrical",{"$nulls":3},{"$f":"SUMIF(Data!$F$2:$F$232,B27,Data!$H$2:$H$232)","v":4},null,"I1102","Other household waste",{"$nulls":3},{"$f":"SUMIF(Data!$F$2:$F$232,I27,Data!$H$2:$H$232)","v":102}]
[null,"I1201","Tyres",{"$nulls":3},{"$f":"SUMIF(Data!$F$2:$F$232,B28,Data!$H$2:$H$232)","v":1},null,"I1202","Other commercial waste",{"$nulls":3},{"$f":"SUMIF(Data!$F$2:$F$232,I28,Data!$H$2:$H$232)","v":3}]
[null,"I1301","Asbestos",{"$nulls":3},{"$f":"SUMIF(Data!$F$2:$F$232,B29,Data!$H$2:$H$232)","v":0},null,"I1302","Other (unidentified)",{"$nulls":3},{"$f":"SUMIF(Data!$F$2:$F$232,I29,Data!$H$2:$H$232)","v":0}]
[null,"I1401","Clinical",{"$nulls":3},{"$f":"SUMIF(Data!$F$2:$F$232,B30,Data!$H$2:$H$232)","v":0}]
[]
[null,null,"Sum of incidents by primary waste type",{"$nulls":3},{"$f":"SUM(G23:G30,N23:N29)","v":132},{"$f":"IF(G32=G7,\"OK\",\"Check\")","v":"OK"},null,{"$f":"IF(H32=\"Check\",\"The total number of incidents recorded in this part does not match the total number given in the first part of the incidents section.\",\"\")","v":""}]
[]
[]
[null,null,"Number of incidents by size and estimated clearance and disposal cost"]
[]
[{"$nulls":6},"Incidents",null,null,"At (£) each",{"$nulls":3},"Total (£)"]
[]
[null,"I1501","Single black bag",{"$nulls":3},{"$f":"SUMIF(Data!$F$2:$F$232,B39,Data!$H$2:$H$232)","v":0},null,"I1502",{"$f":"VLOOKUP(I39,Data!$F:$H,3,FALSE)","v":{"v":7,"d":"£7"}},{"$nulls":3},{"$f":"G39*J39","v":0}]
[null,"I1601","Other single item",{"$nulls":3},{"$f":"SUMIF(Data!$F$2:$F$232,B40,Data!$H$2:$H$232)","v":63},null,"I1602",{"$f":"VLOOKUP(I40,Data!$F:$H,3,FALSE)","v":{"v":29,"d":"£29"}},{"$nulls":3},{"v":1827,"d":"£1,827"}]
{"$rows_left_out":133}
{"sheet":"Data","index":1,"n_rows":98,"n_cols":8,"rows_kept":98}
["AuthorityId","Authority","PeriodId","Period","Section","DataPointId","Item","Value"]
[27,"Hastings Borough Council",330,"Oct 20","Number and estimated cost of actions taken this period","A0101","Investigation",1]
[27,"Hastings Borough Council",330,"Oct 20","Number and estimated cost of actions taken this period","A0102","Investigation - cost per incident",33]
[27,"Hastings Borough Council",330,"Oct 20","Number and estimated cost of actions taken this period","A0202","Warning letter - cost per incident",33]
[27,"Hastings Borough Council",330,"Oct 20","Number and estimated cost of actions taken this period","A0302","Statutory notice - cost per incident",33]
[27,"Hastings Borough Council",330,"Oct 20","Number and estimated cost of actions taken this period","A0402","Fixed penalty notice - cost per incident",33]
[27,"Hastings Borough Council",330,"Oct 20","Number and estimated cost of actions taken this period","A0502","Duty of care inspection - cost per incident",33]
[27,"Hastings Borough Council",330,"Oct 20","Number and estimated cost of actions taken this period","A0602","Stop and search - cost per incident",324]
[27,"Hastings Borough Council",330,"Oct 20","Number and estimated cost of actions taken this period","A0702","Vehicles seized - cost per incident",33]
[27,"Hastings Borough Council",330,"Oct 20","Number and estimated cost of actions taken this period","A0802","Formal Caution - cost per incident",33]
[27,"Hastings Borough Council",330,"Oct 20","Number and estimated cost of actions taken this period","A2001","No actions taken this period",0]
[27,"Hastings Borough Council",330,"Oct 20","Number and estimated cost of actions taken this period","A2102","Fixed penalty notices issued specifically for fly-tipping (s33Za of the Environmental Protection Act 1990) - cost per incident",33]
[27,"Hastings Borough Council",330,"Oct 20","Number and estimated cost of actions taken this period","A2202","Littering fixed penalty notices issued in conjunction with fly-tipping (s88 of the Environmental Protection Act 1990) - cost per incident",33]
[27,"Hastings Borough Council",330,"Oct 20","Number and estimated cost of actions taken this period","A2302","All other fixed penalty notices issued - cost per incident",33]
[27,"Hastings Borough Council",330,"Oct 20","Number and estimated cost of actions taken this period","A2402","Fixed Penalty Notices issued for Household Duty of Care - cost per incident",33]
[27,"Hastings Borough Council",330,"Oct 20","Please select the description that best describes the coverage of your reporting of Fly tipping incidents and actions: ","G0101","General",1]
[27,"Hastings Borough Council",330,"Oct 20","Total incidents","I0101","Total number of incidents this period",55]
[27,"Hastings Borough Council",330,"Oct 20","Number of incidents by land type","I0201","Highway",46]
[27,"Hastings Borough Council",330,"Oct 20","Number of incidents by land type","I0301","Footpath / Bridleway",4]
[27,"Hastings Borough Council",330,"Oct 20","Number of incidents by land type","I0401","Back Alley",3]
[27,"Hastings Borough Council",330,"Oct 20","Number of incidents by land type","I0601","Council Land",1]
[27,"Hastings Borough Council",330,"Oct 20","Number of incidents by land type","I0602","Other (unidentified)",1]
[27,"Hastings Borough Council",330,"Oct 20","Number of incidents by primary waste type","I0702","Construction / demolition / excavation",3]
[27,"Hastings Borough Council",330,"Oct 20","Number of incidents by primary waste type","I0801","Green",2]
[27,"Hastings Borough Council",330,"Oct 20","Number of incidents by primary waste type","I1001","White goods",4]
[27,"Hastings Borough Council",330,"Oct 20","Number of incidents by primary waste type","I1002","Chemical drums, oil, fuel",1]
[27,"Hastings Borough Council",330,"Oct 20","Number of incidents by primary waste type","I1101","Other electrical",2]
[27,"Hastings Borough Council",330,"Oct 20","Number of incidents by primary waste type","I1102","Other household waste",41]
[27,"Hastings Borough Council",330,"Oct 20","Number of incidents by primary waste type","I1202","Other commercial waste",2]
[27,"Hastings Borough Council",330,"Oct 20","Number of incidents by size and estimated clearance and disposal","I1502","Single black bag - cost per incident",7]
[27,"Hastings Borough Council",330,"Oct 20","Number of incidents by size and estimated clearance and disposal","I1601","Other single item",29]
[27,"Hastings Borough Council",330,"Oct 20","Number of incidents by size and estimated clearance and disposal","I1602","Other single item - cost per incident",29]
[27,"Hastings Borough Council",330,"Oct 20","Number of incidents by size and estimated clearance and disposal","I1701","Car boot load or less",20]
[27,"Hastings Borough Council",330,"Oct 20","Number of incidents by size and estimated clearance and disposal","I1702","Car boot load or less - cost per incident",29]
[27,"Hastings Borough Council",330,"Oct 20","Number of incidents by size and estimated clearance and disposal","I1801","Small van load",6]
[27,"Hastings Borough Council",330,"Oct 20","Number of incidents by size and estimated clearance and disposal","I1802","Small van load - cost per incident",56]
[27,"Hastings Borough Council",330,"Oct 20","Number of incidents by size and estimated clearance and disposal","I1902","Transit van load - cost per incident",115]
[27,"Hastings Borough Council",331,"Nov 20","Number and estimated cost of actions taken this period","A0101","Investigation",1]
[27,"Hastings Borough Council",331,"Nov 20","Number and estimated cost of actions taken this period","A0102","Investigation - cost per incident",33]
[27,"Hastings Borough Council",331,"Nov 20","Number and estimated cost of actions taken this period","A0202","Warning letter - cost per incident",33]
{"$rows_left_out":59}
{"sheet":"Historic Data","index":2,"n_rows":104,"n_cols":8,"rows_kept":104}
["AuthorityId","Authority","PeriodId","Period","Section","DataPointId","Item","Value"]
[27,"Hastings Borough Council",312,"Oct 19","Number and estimated cost of actions taken this period","A0101","Investigation",6]
[27,"Hastings Borough Council",312,"Oct 19","Number and estimated cost of actions taken this period","A0102","Investigation - cost per incident",33]
[27,"Hastings Borough Council",312,"Oct 19","Number and estimated cost of actions taken this period","A0201","Warning letter",1]
[27,"Hastings Borough Council",312,"Oct 19","Number and estimated cost of actions taken this period","A0202","Warning letter - cost per incident",33]
[27,"Hastings Borough Council",312,"Oct 19","Number and estimated cost of actions taken this period","A0302","Statutory notice - cost per incident",33]
[27,"Hastings Borough Council",312,"Oct 19","Number and estimated cost of actions taken this period","A0402","Fixed penalty notice - cost per incident",33]
[27,"Hastings Borough Council",312,"Oct 19","Number and estimated cost of actions taken this period","A0502","Duty of care inspection - cost per incident",33]
[27,"Hastings Borough Council",312,"Oct 19","Number and estimated cost of actions taken this period","A0602","Stop and search - cost per incident",324]
[27,"Hastings Borough Council",312,"Oct 19","Number and estimated cost of actions taken this period","A0702","Vehicles seized - cost per incident",33]
[27,"Hastings Borough Council",312,"Oct 19","Number and estimated cost of actions taken this period","A0802","Formal Caution - cost per incident",33]
[27,"Hastings Borough Council",312,"Oct 19","Number of prosecution outcomes","A1301","Fine",0]
[27,"Hastings Borough Council",312,"Oct 19","Number of prosecution outcomes","A1401","Paid fixed penalty notice",1]
[27,"Hastings Borough Council",312,"Oct 19","Number and estimated cost of actions taken this period","A2001","No actions taken this period",0]
[27,"Hastings Borough Council",312,"Oct 19","Number and estimated cost of actions taken this period","A2101","Fixed penalty notices issued specifically for fly-tipping (s33Za of the Environmental Protection Act 1990)",1]
[27,"Hastings Borough Council",312,"Oct 19","Number and estimated cost of actions taken this period","A2102","Fixed penalty notices issued specifically for fly-tipping (s33Za of the Environmental Protection Act 1990) - cost per incident",33]
[27,"Hastings Borough Council",312,"Oct 19","Number and estimated cost of actions taken this period","A2202","Littering fixed penalty notices issued in conjunction with fly-tipping (s88 of the Environmental Protection Act 1990) - cost per incident",33]
[27,"Hastings Borough Council",312,"Oct 19","Number and estimated cost of actions taken this period","A2302","All other fixed penalty notices issued - cost per incident",33]
[27,"Hastings Borough Council",312,"Oct 19","Number and estimated cost of actions taken this period","A2402","Fixed Penalty Notices issued for Household Duty of Care - cost per incident",33]
[27,"Hastings Borough Council",312,"Oct 19","Please select the description that best describes the coverage of your reporting of Fly tipping incidents and actions: ","G0101","General",1]
[27,"Hastings Borough Council",312,"Oct 19","Total incidents","I0101","Total number of incidents this period",71]
[27,"Hastings Borough Council",312,"Oct 19","Number of incidents by land type","I0201","Highway",71]
[27,"Hastings Borough Council",312,"Oct 19","Number of incidents by primary waste type","I0702","Construction / demolition / excavation",5]
[27,"Hastings Borough Council",312,"Oct 19","Number of incidents by primary waste type","I0801","Green",3]
[27,"Hastings Borough Council",312,"Oct 19","Number of incidents by primary waste type","I0902","Black bags - household",13]
[27,"Hastings Borough Council",312,"Oct 19","Number of incidents by primary waste type","I1001","White goods",3]
[27,"Hastings Borough Council",312,"Oct 19","Number of incidents by primary waste type","I1101","Other electrical",11]
[27,"Hastings Borough Council",312,"Oct 19","Number of incidents by primary waste type","I1102","Other household waste",29]
[27,"Hastings Borough Council",312,"Oct 19","Number of incidents by primary waste type","I1202","Other commercial waste",7]
[27,"Hastings Borough Council",312,"Oct 19","Number of incidents by size and estimated clearance and disposal","I1502","Single black bag - cost per incident",7]
[27,"Hastings Borough Council",312,"Oct 19","Number of incidents by size and estimated clearance and disposal","I1601","Other single item",22]
[27,"Hastings Borough Council",312,"Oct 19","Number of incidents by size and estimated clearance and disposal","I1602","Other single item - cost per incident",29]
[27,"Hastings Borough Council",312,"Oct 19","Number of incidents by size and estimated clearance and disposal","I1701","Car boot load or less",7]
[27,"Hastings Borough Council",312,"Oct 19","Number of incidents by size and estimated clearance and disposal","I1702","Car boot load or less - cost per incident",29]
[27,"Hastings Borough Council",312,"Oct 19","Number of incidents by size and estimated clearance and disposal","I1801","Small van load",39]
[27,"Hastings Borough Council",312,"Oct 19","Number of incidents by size and estimated clearance and disposal","I1802","Small van load - cost per incident",56]
[27,"Hastings Borough Council",312,"Oct 19","Number of incidents by size and estimated clearance and disposal","I1901","Transit van load",3]
[27,"Hastings Borough Council",312,"Oct 19","Number of incidents by size and estimated clearance and disposal","I1902","Transit van load - cost per incident",115]
[27,"Hastings Borough Council",313,"Nov 19","Number and estimated cost of actions taken this period","A0101","Investigation",4]
[27,"Hastings Borough Council",313,"Nov 19","Number and estimated cost of actions taken this period","A0102","Investigation - cost per incident",33]
{"$rows_left_out":65}
{"sheet":"Look-up","index":3,"n_rows":359,"n_cols":4,"rows_kept":359,"hidden":true}
[]
[null,"Period ID","Period","Quarter"]
[null,1,"Jul 2003","Jul 03 - Sep 03"]
[null,2,"Aug 2003","Jul 03 - Sep 03"]
[null,3,"Sep 2003","Jul 03 - Sep 03"]
[null,4,"Oct 2003","Oct 03 - Dec 03"]
[null,5,"Nov 2003","Oct 03 - Dec 03"]
[null,6,"Dec 2003","Oct 03 - Dec 03"]
[null,7,"Jan 2004","Jan 04 - Mar 04"]
[null,8,"Feb 2004","Jan 04 - Mar 04"]
[null,9,"Mar 2004","Jan 04 - Mar 04"]
[null,10,"Apr 2004","Apr 04 - Jun 04"]
[null,11,"May 2004","Apr 04 - Jun 04"]
[null,12,"Jun 2004","Apr 04 - Jun 04"]
[null,13,"Jul 2004","Jul 04 - Sep 04"]
[null,14,"Aug 2004","Jul 04 - Sep 04"]
[null,15,"Sep 2004","Jul 04 - Sep 04"]
[null,16,"Oct 2004","Oct 04 - Dec 04"]
[null,17,"Nov 2004","Oct 04 - Dec 04"]
[null,18,"Dec 2004","Oct 04 - Dec 04"]
[null,19,"Jan 2005","Jan 05 - Mar 05"]
[null,20,"Feb 2005","Jan 05 - Mar 05"]
[null,21,"Mar 2005","Jan 05 - Mar 05"]
[null,22,"Apr 2005","Apr 05 - Jun 05"]
[null,23,"May 2005","Apr 05 - Jun 05"]
[null,24,"Jun 2005","Apr 05 - Jun 05"]
[null,25,"Jul 2005","Jul 05 - Sep 05"]
[null,26,"Aug 2005","Jul 05 - Sep 05"]
[null,27,"Sep 2005","Jul 05 - Sep 05"]
[null,28,"Oct 2005","Oct 05 - Dec 05"]
[null,29,"Nov 2005","Oct 05 - Dec 05"]
[null,30,"Dec 2005","Oct 05 - Dec 05"]
[null,31,"Jul 03 - Sep 03","Jul 03 - Sep 03"]
[null,32,"Oct 03 - Dec 03","Oct 03 - Dec 03"]
[null,33,"Jan 04 - Mar 04","Jan 04 - Mar 04"]
[null,34,"Apr 04 - Jun 04","Apr 04 - Jun 04"]
[null,35,"Jul 04 - Sep 04","Jul 04 - Sep 04"]
[null,36,"Oct 04 - Dec 04","Oct 04 - Dec 04"]
[null,37,"Jan 05 - Mar 05","Jan 05 - Mar 05"]
[null,38,"Apr 05 - Jun 05","Apr 05 - Jun 05"]
{"$rows_left_out":320}
{"sheet":"Comments","index":4,"n_rows":1,"n_cols":3,"rows_kept":1}
["Period","(I)ncident or (A)ction","Comment"]