{"text_format":"3","workbook":"xlsx","n_sheets":3,"sheets":["Count Figures","Sheet2","Sheet3"],"not_rendered":{"external_links":1},"read":"whole","date_system":"1900"}

{"sheet":"Count Figures","index":0,"n_rows":19,"n_cols":13,"rows_kept":19}
[null,"Number of ballot papers counted"]
[null,"Area 1","Area 2","Area 3","Area 4","Area 5","Area 6","Area 7","Area 8","Total",null,"% of valid Votes","% of all votes"]
["Remain in EU",{"v":2417,"d":"2,417"},{"v":3113,"d":"3,113"},{"v":2670,"d":"2,670"},{"v":2583,"d":"2,583"},{"v":2846,"d":"2,846"},{"v":2238,"d":"2,238"},{"v":2083,"d":"2,083"},{"v":2061,"d":"2,061"},{"$f":"SUM(B3:I3)","v":{"v":20011,"d":"20,011"}},null,{"$f":"+J3/J6","v":{"v":0.45120631341600903,"d":"45.12%"}},{"$f":"+J3/$J$8","v":{"v":0.45083019803095503,"d":"45.08%"}}]
["Leave EU",{"v":3405,"d":"3,405"},{"v":2605,"d":"2,605"},{"v":2937,"d":"2,937"},{"v":3269,"d":"3,269"},{"v":2882,"d":"2,882"},{"v":3108,"d":"3,108"},{"v":2877,"d":"2,877"},{"v":3256,"d":"3,256"},{"$f":"SUM(B4:I4)","v":{"v":24339,"d":"24,339"}},{"$f":"+J4-J3","v":{"v":4328,"d":"4,328"}},{"$f":"+J4/J6","v":{"v":0.548793686583991,"d":"54.88%"}},{"$f":"+J4/$J$8","v":{"v":0.5483362245702571,"d":"54.83%"}}]
["Number of rejected ballot papers",6,6,4,8,6,1,3,3,{"$f":"SUM(B5:I5)","v":37},null,null,{"$f":"+J5/$J$8","v":{"v":8.335773987879334E-4,"d":"0.08%"}}]
["Total Valid Votes",{"$f":"+B4+B3","v":{"v":5822,"d":"5,822"}},{"v":5718,"d":"5,718"},{"v":5607,"d":"5,607"},{"v":5852,"d":"5,852"},{"v":5728,"d":"5,728"},{"v":5346,"d":"5,346"},{"v":4960,"d":"4,960"},{"v":5317,"d":"5,317"},{"v":44350,"d":"44,350"},null,{"$f":"+L4+L3","v":{"v":1,"d":"100.00%"}},{"$f":"+M5+M4+M3","v":{"v":1,"d":"100.00%"}}]
[]
["Total number of ballot papers",{"$f":"+B5+B6","v":{"v":5828,"d":"5,828"}},{"v":5724,"d":"5,724"},{"v":5611,"d":"5,611"},{"v":5860,"d":"5,860"},{"v":5734,"d":"5,734"},{"v":5347,"d":"5,347"},{"v":4963,"d":"4,963"},{"v":5320,"d":"5,320"},{"v":44387,"d":"44,387"}]
["Total number of ballot papers check against Verification count totals",{"$f":"IF(B8='[1]Verification - Postal Votes'!G2,\"Match\",'[1]Count Figures'!B8-'[1]Verification - Postal Votes'!G2)","v":"Match"},{"$f":"IF(C8='[1]Verification - Postal Votes'!G3,\"Match\",'[1]Count Figures'!C8-'[1]Verification - Postal Votes'!G3)","v":"Match"},{"$f":"IF(D8='[1]Verification - Postal Votes'!G4,\"Match\",'[1]Count Figures'!D8-'[1]Verification - Postal Votes'!G4)","v":"Match"},{"$f":"IF(E8='[1]Verification - Postal Votes'!G5,\"Match\",'[1]Count Figures'!E8-'[1]Verification - Postal Votes'!G5)","v":"Match"},{"$f":"IF(F8='[1]Verification - Postal Votes'!G6,\"Match\",F8-'[1]Verification - Postal Votes'!G6)","v":"Match"},{"$f":"IF(G8='[1]Verification - Postal Votes'!G7,\"Match\",'[1]Count Figures'!G8-'[1]Verification - Postal Votes'!G7)","v":"Match"},{"$f":"IF(H8='[1]Verification - Postal Votes'!G8,\"Match\",'[1]Count Figures'!H8-'[1]Verification - Postal Votes'!G8)","v":"Match"},{"$f":"IF(I8='[1]Verification - Postal Votes'!G9,\"Match\",'[1]Count Figures'!I8-'[1]Verification - Postal Votes'!G9)","v":"Match"},{"$f":"IF(J8='[1]Verification - Postal Votes'!G10,\"Match\",'[1]Count Figures'!J8-'[1]Verification - Postal Votes'!G10)","v":"Match"}]
[]
[null,"Number of ballot papers rejected by category was as follows:"]
[null,"Area 1","Area 2","Area 3","Area 4","Area 5","Area 6","Area 7","Area 8","Total",null,"% of Rejected papers"]
["No official mark",0,0,0,0,0,0,0,0,{"$f":"SUM(B13:I13)","v":0},null,{"$f":"+J13/$J$18","v":{"v":0,"d":"0.00%"}}]
["Voting for both answers to the question asked",3,1,1,3,1,0,1,2,{"$f":"SUM(B14:I14)","v":12},null,{"$f":"+J14/$J$18","v":{"v":0.32432432432432434,"d":"32.43%"}}]
["Writing or mark by which the voter can be identified",0,1,0,2,1,0,0,0,4,null,{"v":0.10810810810810811,"d":"10.81%"}]
["Unmarked or void for uncertainty",3,4,3,3,4,1,2,1,21,null,{"v":0.5675675675675675,"d":"56.76%"}]
[{"$nulls":9},0,null,{"v":0,"d":"0.00%"}]
["Rejected Totals",{"$f":"SUM(B13:B17)","v":6},{"$f":"SUM(C13:C17)","v":6},4,8,6,1,3,3,37,null,{"$f":"SUM(L13:L17)","v":{"v":1,"d":"100.00%"}}]
["Rejected Totals chack against Number of rejected ballot papers",{"$f":"IF(B18=B5,\"Match\",B18-B5)","v":"Match"},{"$f":"IF(C18=C5,\"Match\",C18-C5)","v":"Match"},"Match","Match","Match","Match","Match","Match","Match"]

{"sheet":"Sheet2","index":1,"n_rows":0,"n_cols":0,"rows_kept":0}

{"sheet":"Sheet3","index":2,"n_rows":0,"n_cols":0,"rows_kept":0}